Reaction Details
TargetSomatostatin receptor type 5
LigandBDBM84988
Substrate/Competitorn/a
Ki 12.58±n/a nM
CommentsPDSP_1767
Citation Bruns, CRaulf, FHoyer, DSchloos, JLübbert, HWeckbecker, G Binding properties of somatostatin receptor subtypes. Metab Clin Exp45:17-20 (1996) 
 
Somatostatin receptor type 5
Name:Somatostatin receptor type 5
Type:Enzyme
Mol. Mass.:39218.02
Organism:Homo sapiens (Human)
Description:P35346
Residue:364
BDBM84988
NameBDBM84988
Synonyms:SS-22
TypeSmall organic molecule
Emp. Form.C111H170N31O34S3
Mol. Mass.2578.919
SMILESCSCCC1NC(=O)C(CSSCC(NC(=O)C(C)NC(=O)C(NC(=O)C(CCC[NH+]=C(N)N)NC(=O)C(CO)NC(=O)C(CCCCN)NC(=O)C(Cc2c[nH]c3ccccc23)NC(=O)C(Cc2ccccc2)NC(=O)C(Cc2ccc(O)cc2)NC(=O)C(CC(N)=O)NC1=O)C(C)O)C(O)=O)NC(=O)C(CC(N)=O)NC(=O)C(CC(C)C)NC(=O)C1CCCN1C(=O)C(CCCCN)NC(=O)C(CO)NC(=O)C(NC(=O)C(NC(=O)C(NC(=O)C(CC(N)=O)NC(=O)C(N)CC(O)=O)C(C)O)C(C)C)C(C)O