Reaction Details
Target5-hydroxytryptamine receptor 2B
LigandBDBM82472
Substrate/Competitorn/a
Ki 25.12±n/a nM
CommentsPDSP_456
Citation Baxter, GS Novel discriminatory ligands for 5-HT2B receptors. Behav Brain Res73:149-52 (1996) 
 
5-hydroxytryptamine receptor 2B
Name:5-hydroxytryptamine receptor 2B
Type:Enzyme Catalytic Domain
Mol. Mass.:53668.47
Organism:RAT
Description:5-HT2B HTR2B RAT::P30994
Residue:479
BDBM82472
NameBDBM82472
Synonyms:BW-723C86 NSC_5311036
TypeSmall organic molecule
Emp. Form.C16H18N2OS
Mol. Mass.286.392
SMILESCC(N)Cc1c[nH]c2ccc(OCc3cccs3)cc12