Reaction Details
TargetGamma-aminobutyric acid receptor subunit alpha-1
LigandBDBM50017320
Substrate/Competitorn/a
Ki 0.45±n/a nM
CommentsPDSP_415
Citation Scholze, PEbert, VSieghart, W Affinity of various ligands for GABAA receptors containing alpha 4 beta 3 gamma 2, alpha 4 gamma 2, or alpha 1 beta 3 gamma 2 subunits. Eur J Pharmacol304:155-62 (1996) 
 
Gamma-aminobutyric acid receptor subunit alpha-1
Name:Gamma-aminobutyric acid receptor subunit alpha-1
Type:Protein
Mol. Mass.:51817.35
Organism:Homo sapiens (Human)
Description:P14867
Residue:456
BDBM50017320
NameBDBM50017320
Synonyms:8-Bromo-7-oxo-3b,4,5,6-tetrahydro-7H-2,6a,11b-triaza-benzo[g]cyclopenta[e]azulene-3-carboxylic acid tert-butyl ester CHEMBL444045 | Ro-16-6028
TypeSmall organic molecule
Emp. Form.C19H20BrN3O3
Mol. Mass.418.284
SMILESCC(C)(C)OC(=O)c1ncn-2c1C1CCCN1C(=O)c1c(Br)cccc-21