Reaction Details
TargetGamma-aminobutyric acid receptor subunit alpha-1
LigandBDBM84957
Substrate/Competitorn/a
Ki 0.26±n/a nM
CommentsPDSP_504
Citation Scholze, PEbert, VSieghart, W Affinity of various ligands for GABAA receptors containing alpha 4 beta 3 gamma 2, alpha 4 gamma 2, or alpha 1 beta 3 gamma 2 subunits. Eur J Pharmacol304:155-62 (1996) 
 
Gamma-aminobutyric acid receptor subunit alpha-1
Name:Gamma-aminobutyric acid receptor subunit alpha-1
Type:Protein
Mol. Mass.:51817.35
Organism:Homo sapiens (Human)
Description:P14867
Residue:456
BDBM84957
NameBDBM84957
Synonyms:CGS 9896 | CHEMBL20042
TypeSmall organic molecule
Emp. Form.C16H10ClN3O
Mol. Mass.295.723
SMILESClc1ccc(cc1)-n1[nH]c2c(cnc3ccccc23)c1=O