Reaction Details
TargetD(2) dopamine receptor
LigandBDBM84994
Substrate/Competitorn/a
Ki 1±n/a nM
CommentsPDSP_1422
Citation Bymaster, FPCalligaro, DOFalcone, JFMarsh, RDMoore, NATye, NCSeeman, PWong, DT Radioreceptor binding profile of the atypical antipsychotic olanzapine. Neuropsychopharmacology14:87-96 (1996) 
 
D(2) dopamine receptor
Name:D(2) dopamine receptor
Type:G Protein-Coupled Receptor (GPCR)
Mol. Mass.:50931.60
Organism:Rattus norvegicus (rat)
Description:P61169
Residue:444
BDBM84994
NameBDBM84994
Synonyms:CAS_163091 ORG-5222
TypeSmall organic molecule
Emp. Form.C17H16ClNO
Mol. Mass.285.768
SMILESCN1CC2C(C1)c1cc(Cl)ccc1Oc1ccccc21