Reaction Details
TargetSomatostatin receptor type 2
LigandBDBM85012
Substrate/Competitorn/a
Ki 0.3±n/a nM
CommentsPDSP_561
Citation Bass, RTBuckwalter, BLPatel, BPPausch, MHPrice, LAStrnad, JHadcock, JR Identification and characterization of novel somatostatin antagonists. Mol Pharmacol50:709-15 (1996) Somatostatin receptor type 2
Name:Somatostatin receptor type 2
Type:Enzyme Catalytic Domain
Mol. Mass.:41212.21
Organism:RAT
Description:SOMATOSTATIN SST2 SSTR2 RAT::P30680
Residue:369
BDBM85012
NameBDBM85012
Synonyms:AcNH-4-NO2-Phe-c[D-Cys-Tyr-D-Trp-Lys-Thr-Cys]-Tyr-NH2
TypeSmall organic molecule
Emp. Form.C52H68N12O13S2
Mol. Mass.1133.299
SMILESCC(C)[C@H]1NC(=O)[C@H](CCCCN)NC(=O)[C@@H](Cc2c[nH]c3ccccc23)NC(=O)[C@H](Cc2ccc(O)cc2)NC(=O)[C@@H](CSSC[C@@H](NC1=O)C(=O)N[C@H]([C@H](C)O)C(N)=O)NC(=O)[C@@H](Cc1ccc(cc1)[N+]([O-])=O)NC(C)=O