Reaction Details
TargetMetabotropic glutamate receptor 4
LigandBDBM82355
Substrate/Competitorn/a
Ki>10000±n/a nM
CommentsPDSP_3205
Citation Gomeza, JMary, SBrabet, IParmentier, MLRestituito, SBockaert, JPin, JP Coupling of metabotropic glutamate receptors 2 and 4 to G alpha 15, G alpha 16, and chimeric G alpha q/i proteins: characterization of new antagonists. Mol Pharmacol50:923-30 (1996) Metabotropic glutamate receptor 4
Name:Metabotropic glutamate receptor 4
Type:Enzyme
Mol. Mass.:101849.79
Organism:Rattus norvegicus (Rat)
Description:P31423
Residue:912
BDBM82355
NameBDBM82355
Synonyms:Amino-(3-hydroxy-isoxazol-5-yl)-acetic acid(Ibotenic acid) CHEMBL284895 Ibotenic acid | NSC_1233
TypeSmall organic molecule
Emp. Form.C5H6N2O4
Mol. Mass.158.1121
SMILESNC(C(O)=O)c1cc(=O)[nH]o1