Reaction Details
Target5-hydroxytryptamine receptor 4
LigandBDBM50007863
Substrate/Competitorn/a
Ki 63.09±n/a nM
CommentsPDSP_623
Citation Ansanay, HSebben, MBockaert, JDumuis, A Pharmacological comparison between [3H]GR 113808 binding sites and functional 5-HT4 receptors in neurons. Eur J Pharmacol298:165-74 (1996) 
 
5-hydroxytryptamine receptor 4
Name:5-hydroxytryptamine receptor 4
Type:Enzyme
Mol. Mass.:43767.54
Organism:Homo sapiens (Human)
Description:Q13639
Residue:388
BDBM50007863
NameBDBM50007863
Synonyms:6-Methoxy-2-oxo-2,3-dihydro-benzoimidazole-1-carboxylic acid 8-methyl-8-aza-bicyclo[3.2.1]oct-3-yl ester; hydrochloride DAU 6285
TypeSmall organic molecule
Emp. Form.C17H21N3O4
Mol. Mass.331.3663
SMILESCOc1ccc2[nH]c(=O)n(C(=O)OC3CC4CCC(C3)N4C)c2c1