Reaction Details
Target5-hydroxytryptamine receptor 4
LigandBDBM82422
Substrate/Competitorn/a
Ki 251.18±n/a nM
CommentsPDSP_1594
Citation Ansanay, HSebben, MBockaert, JDumuis, A Pharmacological comparison between [3H]GR 113808 binding sites and functional 5-HT4 receptors in neurons. Eur J Pharmacol298:165-74 (1996) 
 
5-hydroxytryptamine receptor 4
Name:5-hydroxytryptamine receptor 4
Type:Enzyme
Mol. Mass.:43767.54
Organism:Homo sapiens (Human)
Description:Q13639
Residue:388
BDBM82422
NameBDBM82422
Synonyms:CAS_109872-41-5 RENZAPRIDE
TypeSmall organic molecule
Emp. Form.C16H22ClN3O2
Mol. Mass.323.818
SMILESCOc1cc(N)c(Cl)cc1C(=O)NC1CCN2CCCC1C2