Reaction Details
TargetMelanocortin receptor 3
LigandBDBM85022
Substrate/Competitorn/a
Ki 9.85±n/a nM
CommentsPDSP_3048
Citation Schiöth, HBMuceniece, RWikberg, JE Characterisation of the melanocortin 4 receptor by radioligand binding. Pharmacol Toxicol79:161-5 (1996) 
 
Melanocortin receptor 3
Name:Melanocortin receptor 3
Type:Enzyme
Mol. Mass.:36044.86
Organism:Homo sapiens (Human)
Description:P41968
Residue:323
BDBM85022
NameBDBM85022
Synonyms:alpha-MSH, [Nle4]
TypeSmall organic molecule
Emp. Form.C78H110N20O20
Mol. Mass.1647.83
SMILESCCCC[C@H](NC(=O)[C@H](CO)NC(=O)[C@H](Cc1ccc(O)cc1)NC(=O)[C@H](CO)NC(C)=O)C(=O)N[C@@H](CCC(O)=O)C(=O)N[C@@H](Cc1cnc[nH]1)C(=O)N[C@@H](Cc1ccccc1)C(=O)N[C@@H](CCCN=C(N)N)C(=O)N[C@@H](Cc1c[nH]c2ccccc12)C(=O)NCC(=O)N[C@@H](CCCCN)C(=O)N1CCC[C@H]1C(=O)N[C@@H](C(C)C)C(O)=O