Reaction Details
Target5-hydroxytryptamine receptor 1A/1B/1D/2C
LigandBDBM50049750
Substrate/Competitorn/a
Ki>10000±n/a nM
CommentsPDSP_218
Citation Sullivan, JPDonnelly-Roberts, DBriggs, CAAnderson, DJGopalakrishnan, MPiattoni-Kaplan, MCampbell, JEMcKenna, DGMolinari, EHettinger, AMGarvey, DSWasicak, JTHolladay, MWWilliams, MArneric, SP A-85380 [3-(2(S)-azetidinylmethoxy) pyridine]: in vitro pharmacological properties of a novel, high affinity alpha 4 beta 2 nicotinic acetylcholine receptor ligand. Neuropharmacology35:725-34 (1996) 
 
5-hydroxytryptamine receptor 1A/1B/1D/2C
Name:5-hydroxytryptamine receptor 1A/1B/1D/2C
Synonyms:5-HT1
Type:n/a
Mol. Mass.:n/a
Description:TL
Components:This complex has 0 components.
Component 1
Name:5-hydroxytryptamine receptor 1A
Type:n/a
Mol. Mass.:46122.49
Organism:Homo sapiens (Human)
Description:n/a
Residue:422
Component 2
Name:5-hydroxytryptamine receptor 1B
Synonyms:5-HT-1B 5-HT1B 5HT1B_HUMAN HTR1DB Serotonin (5-HT) receptor Serotonin Receptor 1B
Type:G Protein-Coupled Receptor (GPCR)
Mol. Mass.:43579.17
Organism:Homo sapiens (Human)
Description:Receptor binding assays were performed using human clone stably expressed in CHO cells
Residue:390
Component 3
Name:5-hydroxytryptamine receptor 2C
Synonyms:5-HT-2C 5-HT2C-INI 5-HTR2C 5-hydroxytryptamine receptor 2C (5-HT-2C) 5HT-1C HTR1C Serotonin (5-HT3) receptor Serotonin Receptor 2C
Type:G Protein-Coupled Receptor (GPCR)
Mol. Mass.:51836.79
Organism:Homo sapiens (Human)
Description:P28335
Residue:458
Component 4
Name:5-hydroxytryptamine receptor 1D
Synonyms:5-HT-1D 5-HT1D 5HT1D_HUMAN HTR1DA Serotonin (5-HT) receptor | Serotonin Receptor 1D
Type:G Protein-Coupled Receptor (GPCR)
Mol. Mass.:41920.63
Organism:Homo sapiens (Human)
Description:Receptor binding assays were performed using human clone stably expressed in CHO cells.
Residue:377
BDBM50049750
NameBDBM50049750
Synonyms:(S)-3-(azetidin-2-ylmethoxy)pyridine A-159470 CHEMBL59986
TypeSmall organic molecule
Emp. Form.C9H12N2O
Mol. Mass.164.2044
SMILESC(Oc1cccnc1)[C@@H]1CCN1