Reaction Details
TargetBeta-2 adrenergic receptor
LigandBDBM50049750
Substrate/Competitorn/a
Ki>10000±n/a nM
CommentsPDSP_218
Citation Sullivan, JPDonnelly-Roberts, DBriggs, CAAnderson, DJGopalakrishnan, MPiattoni-Kaplan, MCampbell, JEMcKenna, DGMolinari, EHettinger, AMGarvey, DSWasicak, JTHolladay, MWWilliams, MArneric, SP A-85380 [3-(2(S)-azetidinylmethoxy) pyridine]: in vitro pharmacological properties of a novel, high affinity alpha 4 beta 2 nicotinic acetylcholine receptor ligand. Neuropharmacology35:725-34 (1996) 
 
Beta-2 adrenergic receptor
Name:Beta-2 adrenergic receptor
Type:PROTEIN
Mol. Mass.:47002.38
Organism:Mus musculus
Description:ChEMBL_196404
Residue:418
BDBM50049750
NameBDBM50049750
Synonyms:(S)-3-(azetidin-2-ylmethoxy)pyridine A-159470 CHEMBL59986
TypeSmall organic molecule
Emp. Form.C9H12N2O
Mol. Mass.164.2044
SMILESC(Oc1cccnc1)[C@@H]1CCN1