Reaction Details
TargetHrh3 protein
LigandBDBM7966
Substrate/Competitorn/a
Ki 25.11±n/a nM
CommentsPDSP_934
Citation Brown, JDO'Shaughnessy, CTKilpatrick, GJScopes, DIBeswick, PClitherow, JWBarnes, JC Characterisation of the specific binding of the histamine H3 receptor antagonist radioligand [3H]GR168320. Eur J Pharmacol311:305-10 (1996) 
 
Hrh3 protein
Name:Hrh3 protein
Type:Enzyme Catalytic Domain
Mol. Mass.:37860.96
Organism:RAT
Description:Q5PPG3
Residue:344
BDBM7966
NameBDBM7966
Synonyms:2-(1H-imidazol-4-yl)ethan-1-amine CHEMBL90 Ergotidine Histamine Peremin | [3H]histamine
TypeSmall organic molecule
Emp. Form.C5H9N3
Mol. Mass.111.1451
SMILESNCCc1cnc[nH]1