Reaction Details
TargetHrh3 protein
LigandBDBM22567
Substrate/Competitorn/a
Ki 7943.28±n/a nM
CommentsPDSP_1202
Citation Brown, JDO'Shaughnessy, CTKilpatrick, GJScopes, DIBeswick, PClitherow, JWBarnes, JC Characterisation of the specific binding of the histamine H3 receptor antagonist radioligand [3H]GR168320. Eur J Pharmacol311:305-10 (1996) 
 
Hrh3 protein
Name:Hrh3 protein
Type:Enzyme Catalytic Domain
Mol. Mass.:37860.96
Organism:RAT
Description:Q5PPG3
Residue:344
BDBM22567
NameBDBM22567
Synonyms:3H]pyrilamine Dorantamin N-(4-methoxybenzyl)-N ,N -dimethyl-N-pyridin-2-ylethane-1,2-diamine PYRILAMINE [3H]mepyramine | [3H]pyrilamine
Typeradiolabeled ligand
Emp. Form.C17H23N3O
Mol. Mass.285.384
SMILESCOc1ccc(CN(CCN(C)C)c2ccccn2)cc1