Reaction Details
Target5-hydroxytryptamine receptor 1D
LigandBDBM50005835
Substrate/Competitorn/a
Ki 1.7±n/a nM
CommentsPDSP_1788
Citation Schotte, AJanssen, PFGommeren, WLuyten, WHVan Gompel, PLesage, ASDe Loore, KLeysen, JE Risperidone compared with new and reference antipsychotic drugs: in vitro and in vivo receptor binding. Psychopharmacology (Berl)124:57-73 (1996) 
 
5-hydroxytryptamine receptor 1D
Name:5-hydroxytryptamine receptor 1D
Type:G Protein-Coupled Receptor (GPCR)
Mol. Mass.:41920.63
Organism:Homo sapiens (Human)
Description:Receptor binding assays were performed using human clone stably expressed in CHO cells.
Residue:377
BDBM50005835
NameBDBM50005835
Synonyms:(3-[2-(dimethylamino)ethyl]-1H-indol-5-yl)-N-methylmethanesulfonamide 1-{3-[2-(dimethylamino)ethyl]-1H-indol-5-yl}-N-methylmethanesulfonamide 3-[2-(dimethylamino)ethyl]-N-methylindole-5-methanesulfonamide SUMATRIPTAN Sumax
TypeSmall organic molecule
Emp. Form.C14H21N3O2S
Mol. Mass.295.4
SMILESCNS(=O)(=O)Cc1ccc2[nH]cc(CCN(C)C)c2c1