Reaction Details
TargetBeta-1 adrenergic receptor
LigandBDBM26948
Substrate/Competitorn/a
Ki 590±n/a nM
CommentsPDSP_843
Citation Schotte, AJanssen, PFGommeren, WLuyten, WHVan Gompel, PLesage, ASDe Loore, KLeysen, JE Risperidone compared with new and reference antipsychotic drugs: in vitro and in vivo receptor binding. Psychopharmacology (Berl)124:57-73 (1996) 
 
Beta-1 adrenergic receptor
Name:Beta-1 adrenergic receptor
Type:G Protein-Coupled Receptor (GPCR)
Mol. Mass.:51338.40
Organism:Homo sapiens (Human)
Description:P08588
Residue:477
BDBM26948
NameBDBM26948
Synonyms:8-[4,4-bis(4-fluorophenyl)butyl]-1-phenyl-1,3,8-triazaspiro[4.5]decan-4-one FLUSPIRILENE cid_3396 spiropiperidine analogue, 1
TypeSmall organic molecule
Emp. Form.C29H31F2N3O
Mol. Mass.475.5727
SMILESFc1ccc(cc1)C(CCCN1CCC2(CC1)N(CNC2=O)c1ccccc1)c1ccc(F)cc1