Reaction Details
TargetD(3) dopamine receptor
LigandBDBM84994
Substrate/Competitorn/a
Ki 4.2±n/a nM
CommentsPDSP_1422
Citation Schotte, AJanssen, PFGommeren, WLuyten, WHVan Gompel, PLesage, ASDe Loore, KLeysen, JE Risperidone compared with new and reference antipsychotic drugs: in vitro and in vivo receptor binding. Psychopharmacology (Berl)124:57-73 (1996) 
 
D(3) dopamine receptor
Name:D(3) dopamine receptor
Type:Protein
Mol. Mass.:49540.58
Organism:Rattus norvegicus (Rat)
Description:P19020
Residue:446
BDBM84994
NameBDBM84994
Synonyms:CAS_163091 ORG-5222
TypeSmall organic molecule
Emp. Form.C17H16ClNO
Mol. Mass.285.768
SMILESCN1CC2C(C1)c1cc(Cl)ccc1Oc1ccccc21