Reaction Details
TargetHistamine H1 receptor
LigandBDBM24226
Substrate/Competitorn/a
Ki 0.8±n/a nM
CommentsPDSP_329
Citation Schotte, AJanssen, PFGommeren, WLuyten, WHVan Gompel, PLesage, ASDe Loore, KLeysen, JE Risperidone compared with new and reference antipsychotic drugs: in vitro and in vivo receptor binding. Psychopharmacology (Berl)124:57-73 (1996) 
 
Histamine H1 receptor
Name:Histamine H1 receptor
Type:G Protein-Coupled Receptor (GPCR)
Mol. Mass.:55641.53
Organism:Cavia porcellus (domestic guinea pig)
Description:Guinea pig cerebellum was used in binding assay.
Residue:488
BDBM24226
NameBDBM24226
Synonyms:1-[(4-fluorophenyl)methyl]-N-{1-[2-(4-methoxyphenyl)ethyl]piperidin-4-yl}-1H-1,3-benzodiazol-2-amine Astemizole, [O-Methyl-3H] Hismanal [3H]-ASTEMIZOLE cid_2247 | med.21724, Compound Astemizole
TypeRadiolabeled ligand
Emp. Form.C28H31FN4O
Mol. Mass.458.5703
SMILESCOc1ccc(CCN2CCC(CC2)Nc2nc3ccccc3n2Cc2ccc(F)cc2)cc1