Reaction Details
TargetNorepinephrine transporter
LigandBDBM35255
Substrate/Competitorn/a
Ki 1000±n/a nM
CommentsPDSP_2002
Citation Schotte, AJanssen, PFGommeren, WLuyten, WHVan Gompel, PLesage, ASDe Loore, KLeysen, JE Risperidone compared with new and reference antipsychotic drugs: in vitro and in vivo receptor binding. Psychopharmacology (Berl)124:57-73 (1996) 
 
Norepinephrine transporter
Name:Norepinephrine transporter
Synonyms:n/a
Type:Enzyme Catalytic Domain
Mol. Mass.:2082.45
Organism:RAT
Description:Norepinephrine transporter 0 RAT::Q9JIA2
Residue:19
MLLARMKPQVQPELGGADQ
BDBM35255
NameBDBM35255
TypeSmall organic molecule
Emp. Form.C18H18ClNOS
Mol. Mass.331.86
SMILESCN(C)CCOC1=Cc2ccccc2Sc2ccc(Cl)cc12