Reaction Details
TargetBeta-arrestin-1
LigandBDBM22869
Substrate/Competitorn/a
Ki 1000±n/a nM
CommentsPDSP_552
Citation Schotte, AJanssen, PFGommeren, WLuyten, WHVan Gompel, PLesage, ASDe Loore, KLeysen, JE Risperidone compared with new and reference antipsychotic drugs: in vitro and in vivo receptor binding. Psychopharmacology (Berl)124:57-73 (1996) 
 
Beta-arrestin-1
Name:Beta-arrestin-1
Type:Enzyme Catalytic Domain
Mol. Mass.:46360.54
Organism:RABBIT
Description:Cholinergic, muscarinic 0 RABBIT::Q95223
Residue:410
BDBM22869
NameBDBM22869
Synonyms:6-chloro-10-(4-methylpiperazin-1-yl)-2,9-diazatricyclo[9.4.0.0^{3,8}]pentadeca-1,3(8),4,6,10,12,14-heptaene Clozapine US10259786, Clozapine
TypeSmall organic molecule
Emp. Form.C18H19ClN4
Mol. Mass.326.823
SMILESCN1CCN(CC1)C1=c2ccccc2=Nc2ccc(Cl)cc2N1