Reaction Details
TargetSigma non-opioid intracellular receptor 1
LigandBDBM81924
Substrate/Competitorn/a
Ki 0.58±n/a nM
CommentsPDSP_93
Citation Schotte, AJanssen, PFGommeren, WLuyten, WHVan Gompel, PLesage, ASDe Loore, KLeysen, JE Risperidone compared with new and reference antipsychotic drugs: in vitro and in vivo receptor binding. Psychopharmacology (Berl)124:57-73 (1996) 
 
Sigma non-opioid intracellular receptor 1
Name:Sigma non-opioid intracellular receptor 1
Type:Protein
Mol. Mass.:25307.17
Organism:Cavia porcellus (Guinea pig)
Description:Q60492
Residue:223
BDBM81924
NameBDBM81924
Synonyms:(R)-3-(1-Propyl-piperidin-3-yl)-phenol CAS_85976-54-1 NSC_202477 PPP, S(-)-3
TypeSmall organic molecule
Emp. Form.C14H21NO
Mol. Mass.219.3226
SMILESCCCN1CCCC(C1)c1cccc(O)c1