Reaction Details
TargetProtachykinin-1
LigandBDBM84994
Substrate/Competitorn/a
Ki 1000±n/a nM
CommentsPDSP_1422
Citation Schotte, AJanssen, PFGommeren, WLuyten, WHVan Gompel, PLesage, ASDe Loore, KLeysen, JE Risperidone compared with new and reference antipsychotic drugs: in vitro and in vivo receptor binding. Psychopharmacology (Berl)124:57-73 (1996) 
 
Protachykinin-1
Name:Protachykinin-1
Type:Enzyme Catalytic Domain
Mol. Mass.:15006.99
Organism:Homo sapiens (Human)
Description:Substance P 0 HUMAN::P20366
Residue:129
BDBM84994
NameBDBM84994
Synonyms:CAS_163091 ORG-5222
TypeSmall organic molecule
Emp. Form.C17H16ClNO
Mol. Mass.285.768
SMILESCN1CC2C(C1)c1cc(Cl)ccc1Oc1ccccc21