Reaction Details
Target5-hydroxytryptamine receptor 4
LigandBDBM84648
Substrate/Competitorn/a
Ki 25.11±n/a nM
CommentsPDSP_400
Citation Claeysen, SSebben, MJournot, LBockaert, JDumuis, A Cloning, expression and pharmacology of the mouse 5-HT(4L) receptor. FEBS Lett398:19-25 (1996) 
 
5-hydroxytryptamine receptor 4
Name:5-hydroxytryptamine receptor 4
Type:Enzyme Catalytic Domain
Mol. Mass.:43970.99
Organism:MOUSE
Description:5-HT4 HTR4 MOUSE::P97288
Residue:388
BDBM84648
NameBDBM84648
Synonyms:BIMU 8
TypeSmall organic molecule
Emp. Form.C19H26N4O2
Mol. Mass.342.4353
SMILESCC(C)n1c2ccccc2n(C(=O)NC2C[C@@H]3CC[C@H](C2)N3C)c1=O