Reaction Details
Target5-hydroxytryptamine receptor 4
LigandBDBM50056401
Substrate/Competitorn/a
Ki 6.3±n/a nM
CommentsPDSP_1689
Citation Claeysen, SSebben, MJournot, LBockaert, JDumuis, A Cloning, expression and pharmacology of the mouse 5-HT(4L) receptor. FEBS Lett398:19-25 (1996) 
 
5-hydroxytryptamine receptor 4
Name:5-hydroxytryptamine receptor 4
Type:Enzyme Catalytic Domain
Mol. Mass.:43970.99
Organism:MOUSE
Description:5-HT4 HTR4 MOUSE::P97288
Residue:388
BDBM50056401
NameBDBM50056401
Synonyms:2-diethylaminoethyl [2-methoxy-4-amino-5-chloro]benzoate CHEMBL287045 SDZ-205557
TypeSmall organic molecule
Emp. Form.C14H21ClN2O3
Mol. Mass.300.781
SMILESCCN(CC)CCOC(=O)c1cc(Cl)c(N)cc1OC