Reaction Details
TargetMuscarinic acetylcholine receptor M2
LigandBDBM50034625
Substrate/Competitorn/a
Ki>10000±n/a nM
CommentsPDSP_224
Citation Ehlert, FJGriffin, MTGlidden, PF The interaction of the enantiomers of aceclidine with subtypes of the muscarinic receptor. J Pharmacol Exp Ther279:1335-44 (1996) Muscarinic acetylcholine receptor M2
Name:Muscarinic acetylcholine receptor M2
Type:Enzyme Catalytic Domain
Mol. Mass.:51555.53
Organism:RAT
Description:P10980
Residue:466
BDBM50034625
NameBDBM50034625
Synonyms:Aceclidine Acetic acid 1-aza-bicyclo[2.2.2]oct-3-yl ester(aceclidine) aceclidine,R(-) | aceclidine,S(+)
TypeSmall organic molecule
Emp. Form.C9H15NO2
Mol. Mass.169.2209
SMILESCC(=O)OC1CN2CCC1CC2