Reaction Details
TargetMuscarinic acetylcholine receptor M3
LigandBDBM50005677
Substrate/Competitorn/a
Ki 8700±n/a nM
CommentsPDSP_1425
Citation Ehlert, FJGriffin, MTGlidden, PF The interaction of the enantiomers of aceclidine with subtypes of the muscarinic receptor. J Pharmacol Exp Ther279:1335-44 (1996) Muscarinic acetylcholine receptor M3
Name:Muscarinic acetylcholine receptor M3
Type:Enzyme Catalytic Domain
Mol. Mass.:66086.66
Organism:RAT
Description:Cholinergic, muscarinic M3 CHRM3 RAT::P08483
Residue:589
BDBM50005677
NameBDBM50005677
Synonyms:CHEMBL23957 Trimethyl-[4-(2-oxo-pyrrolidin-1-yl)-but-2-ynyl]-ammonium; iodide
TypeSmall organic molecule
Emp. Form.C11H19N2O
Mol. Mass.195.2808
SMILESC[N+](C)(C)CC#CCN1CCCC1=O