Reaction Details
TargetD(4) dopamine receptor
LigandBDBM50051563
Substrate/Competitorn/a
Ki 10.1±n/a nM
CommentsPDSP_1932
Citation Merchant, KMGill, GSHarris, DWHuff, RMEaton, MJLookingland, KLutzke, BSMccall, RBPiercey, MFSchreur, PJSethy, VHSmith, MWSvensson, KATang, AHVonvoigtlander, PFTenbrink, RE Pharmacological characterization of U-101387, a dopamine D4 receptor selective antagonist. J Pharmacol Exp Ther279:1392-403 (1996) D(4) dopamine receptor
Name:D(4) dopamine receptor
Type:Enzyme
Mol. Mass.:48373.19
Organism:Homo sapiens (Human)
Description:P21917
Residue:419
BDBM50051563
NameBDBM50051563
Synonyms:4-[4-((R)-2-Isochroman-1-yl-ethyl)-piperazin-1-yl]-benzenesulfonamide U-101387
TypeSmall organic molecule
Emp. Form.C21H27N3O3S
Mol. Mass.401.522
SMILESNS(=O)(=O)c1ccc(cc1)N1CCN(CC[C@H]2OCCc3ccccc23)CC1