Reaction Details
Target5-hydroxytryptamine receptor 2A
LigandBDBM81790
Substrate/Competitorn/a
Ki 2000±n/a nM
CommentsPDSP_287
Citation Schoemaker, HClaustre, YFage, DRouquier, LChergui, KCuret, OOblin, AGonon, FCarter, CBenavides, JScatton, B Neurochemical characteristics of amisulpride, an atypical dopamine D2/D3 receptor antagonist with both presynaptic and limbic selectivity. J Pharmacol Exp Ther280:83-97 (1997) 5-hydroxytryptamine receptor 2A
Name:5-hydroxytryptamine receptor 2A
Type:G Protein-Coupled Receptor (GPCR)
Mol. Mass.:52852.05
Organism:Rattus norvegicus (rat)
Description:Rat cortex membranes 5-HT2A receptors.
Residue:471
BDBM81790
NameBDBM81790
Synonyms:Amisulpride NSC_2159 US10259786, Amisulpride
TypeSmall organic molecule
Emp. Form.C17H27N3O4S
Mol. Mass.369.479
SMILESCCN1CCCC1CNC(=O)c1cc(c(N)cc1OC)S(=O)(=O)CC