Reaction Details
TargetAdenosine receptor A1
LigandBDBM21173
Substrate/Competitorn/a
Ki 1±n/a nM
CommentsPDSP_739
Citation Hill, RJOleynek, JJHoth, CFKiron, MAWeng, WWester, RTTracey, WRKnight, DRBuchholz, RAKennedy, SP Cloning, expression and pharmacological characterization of rabbit adenosine A1 and A3 receptors. J Pharmacol Exp Ther280:122-8 (1997) Adenosine receptor A1
Name:Adenosine receptor A1
Type:Enzyme
Mol. Mass.:36566.33
Organism:Oryctolagus cuniculus (Rabbit)
Description:P34970
Residue:328
BDBM21173
NameBDBM21173
Synonyms:1,3-dipropyl-8-cyclopentylxanthine CHEMBL183 PD116948 | [3H]DPCPX
Typeradiolabeled ligand
Emp. Form.C16H24N4O2
Mol. Mass.304.3874
SMILESCCCn1c2nc([nH]c2c(=O)n(CCC)c1=O)C1CCCC1