Reaction Details
TargetAdenosine receptor A1
LigandBDBM50006730
Substrate/Competitorn/a
Ki 1±n/a nM
CommentsPDSP_1618
Citation Hill, RJOleynek, JJHoth, CFKiron, MAWeng, WWester, RTTracey, WRKnight, DRBuchholz, RAKennedy, SP Cloning, expression and pharmacological characterization of rabbit adenosine A1 and A3 receptors. J Pharmacol Exp Ther280:122-8 (1997) Adenosine receptor A1
Name:Adenosine receptor A1
Type:Enzyme
Mol. Mass.:36566.33
Organism:Oryctolagus cuniculus (Rabbit)
Description:P34970
Residue:328
BDBM50006730
NameBDBM50006730
Synonyms:(R)-2-Hydroxymethyl-5-[6-(1-methyl-2-phenyl-ethylamino)-purin-9-yl]-tetrahydro-furan-3,4-diol (S)-2-Hydroxymethyl-5-[6-(1-methyl-2-phenyl-ethylamino)-purin-9-yl]-tetrahydro-furan-3,4-diol 2-Hydroxymethyl-5-[6-(1-methyl-2-phenyl-ethylamino)-purin-9-yl]-tetrahydro-furan-3,4-diol ChEMBL_20163 L-2-Hydroxymethyl-5-[6-(1-methyl-2-phenyl-ethylamino)-purin-9-yl]-tetrahydro-furan-3,4-diol R-PIA | S-PIA
TypeSmall organic molecule
Emp. Form.C19H23N5O4
Mol. Mass.385.417
SMILESCC(Cc1ccccc1)Nc1ncnc2n(cnc12)C1OC(CO)C(O)C1O