Reaction Details
Target5-hydroxytryptamine receptor 6
LigandBDBM22869
Substrate/Competitorn/a
Ki 7.1±n/a nM
CommentsPDSP_552
Citation Kongsamut, SRoehr, JECai, JHartman, HBWeissensee, PKerman, LLTang, LSandrasagra, A Iloperidone binding to human and rat dopamine and 5-HT receptors. Eur J Pharmacol317:417-23 (1996) 
 
5-hydroxytryptamine receptor 6
Name:5-hydroxytryptamine receptor 6
Type:Enzyme Catalytic Domain
Mol. Mass.:46945.51
Organism:RAT
Description:5-HT6 HTR6 RAT::P31388
Residue:436
BDBM22869
NameBDBM22869
Synonyms:6-chloro-10-(4-methylpiperazin-1-yl)-2,9-diazatricyclo[9.4.0.0^{3,8}]pentadeca-1,3(8),4,6,10,12,14-heptaene Clozapine US10259786, Clozapine
TypeSmall organic molecule
Emp. Form.C18H19ClN4
Mol. Mass.326.823
SMILESCN1CCN(CC1)C1=c2ccccc2=Nc2ccc(Cl)cc2N1