Reaction Details
TargetD(3) dopamine receptor
LigandBDBM50034043
Substrate/Competitorn/a
Ki 7.1±n/a nM
CommentsPDSP_964
Citation Kongsamut, SRoehr, JECai, JHartman, HBWeissensee, PKerman, LLTang, LSandrasagra, A Iloperidone binding to human and rat dopamine and 5-HT receptors. Eur J Pharmacol317:417-23 (1996) 
 
D(3) dopamine receptor
Name:D(3) dopamine receptor
Type:n/a
Mol. Mass.:44243.43
Organism:Homo sapiens (Human)
Description:n/a
Residue:400
BDBM50034043
NameBDBM50034043
Synonyms:1-(4-{3-[4-(6-Fluoro-benzo[d]isoxazol-3-yl)-piperidin-1-yl]-propoxy}-3-methoxy-phenyl)-ethanone ILOPERIDONE
TypeSmall organic molecule
Emp. Form.C24H27FN2O4
Mol. Mass.426.4806
SMILESCOc1cc(ccc1OCCCN1CCC(CC1)c1noc2cc(F)ccc12)C(C)=O