Reaction Details
Target5-hydroxytryptamine receptor 2A
LigandBDBM22869
Substrate/Competitorn/a
Ki 11±n/a nM
CommentsPDSP_552
Citation Seeman, PCorbett, RVan Tol, HH Atypical neuroleptics have low affinity for dopamine D2 receptors or are selective for D4 receptors. Neuropsychopharmacology16:93 (1997) 
 
5-hydroxytryptamine receptor 2A
Name:5-hydroxytryptamine receptor 2A
Type:undefined
Mol. Mass.:52607.65
Organism:Homo sapiens (Human)
Description:P28223
Residue:471
BDBM22869
NameBDBM22869
Synonyms:6-chloro-10-(4-methylpiperazin-1-yl)-2,9-diazatricyclo[9.4.0.0^{3,8}]pentadeca-1,3(8),4,6,10,12,14-heptaene Clozapine US10259786, Clozapine
TypeSmall organic molecule
Emp. Form.C18H19ClN4
Mol. Mass.326.823
SMILESCN1CCN(CC1)C1=c2ccccc2=Nc2ccc(Cl)cc2N1