Reaction Details
TargetP2X purinoceptor 4
LigandBDBM85044
Substrate/Competitorn/a
Ki 301.5±n/a nM
CommentsPDSP_3586
Citation Garcia-Guzman, MSoto, FGomez-Hernandez, JMLund, PEStühmer, W Characterization of recombinant human P2X4 receptor reveals pharmacological differences to the rat homologue. Mol Pharmacol51:109-18 (1997) 
 
P2X purinoceptor 4
Name:P2X purinoceptor 4
Type:Enzyme Catalytic Domain
Mol. Mass.:43504.16
Organism:RAT
Description:Purinergic, P2X4 0 RAT::P51577
Residue:388
BDBM85044
NameBDBM85044
Synonyms:Bromphenol blue CAS_115-39-9 NSC_8272
TypeSmall organic molecule
Emp. Form.C19H10Br4O5S
Mol. Mass.669.961
SMILESOc1c(Br)cc(cc1Br)C1(OS(=O)(=O)c2ccccc12)c1cc(Br)c(O)c(Br)c1