Reaction Details
TargetP2X purinoceptor 4
LigandBDBM50300129
Substrate/Competitorn/a
Ki 128.3±n/a nM
CommentsPDSP_3584
Citation Garcia-Guzman, MSoto, FGomez-Hernandez, JMLund, PEStühmer, W Characterization of recombinant human P2X4 receptor reveals pharmacological differences to the rat homologue. Mol Pharmacol51:109-18 (1997) 
 
P2X purinoceptor 4
Name:P2X purinoceptor 4
Type:Enzyme Catalytic Domain
Mol. Mass.:43504.16
Organism:RAT
Description:Purinergic, P2X4 0 RAT::P51577
Residue:388
BDBM50300129
NameBDBM50300129
Synonyms:CHEMBL572528 Cibacron Blue 3Ga
TypeSmall organic molecule
Emp. Form.C29H20ClN7O11S3
Mol. Mass.774.157
SMILESNc1c(cc(Nc2ccc(Nc3nc(Cl)nc(Nc4ccccc4S(O)(=O)=O)n3)c(c2)S(O)(=O)=O)c2C(=O)c3ccccc3C(=O)c12)S(O)(=O)=O