Reaction Details
TargetNeurotensin/neuromedin N
LigandBDBM85050
Substrate/Competitorn/a
Ki 0.28±n/a nM
CommentsPDSP_1750
Citation Gully, DLabeeuw, BBoigegrain, ROury-Donat, FBachy, APoncelet, MSteinberg, RSuaud-Chagny, MFSantucci, VVita, NPecceu, FLabbé-Jullié, CKitabgi, PSoubrié, PLe Fur, GMaffrand, JP Biochemical and pharmacological activities of SR 142948A, a new potent neurotensin receptor antagonist. J Pharmacol Exp Ther280:802-12 (1997) Neurotensin/neuromedin N
Name:Neurotensin/neuromedin N
Type:Enzyme Catalytic Domain
Mol. Mass.:19796.77
Organism:Homo sapiens (Human)
Description:NT 0 HUMAN::P30990
Residue:170
BDBM85050
NameBDBM85050
Synonyms:CAS_184162-64-9 SR142948 | SR142948A
TypeSmall organic molecule
Emp. Form.C39H51N5O6
Mol. Mass.685.8521
SMILES[H]C12CC3([H])CC([H])(C1)C(NC(=O)c1cc(-c4c(OC)cccc4OC)n(n1)-c1ccc(cc1C(C)C)C(=O)N(C)CCCN(C)C)(C(O)=O)C([H])(C2)C3