Reaction Details
TargetEndothelin-1 receptor
LigandBDBM50034267
Substrate/Competitorn/a
Ki 0.92±n/a nM
CommentsPDSP_1446
Citation Maguire, JJKuc, REDavenport, AP Affinity and selectivity of PD156707, a novel nonpeptide endothelin antagonist, for human ET(A) and ET(B) receptors. J Pharmacol Exp Ther280:1102-8 (1997) Endothelin-1 receptor
Name:Endothelin-1 receptor
Type:Enzyme Catalytic Domain
Mol. Mass.:48736.88
Organism:Homo sapiens (Human)
Description:P25101
Residue:427
BDBM50034267
NameBDBM50034267
Synonyms:3-(benzo[d][1,3]dioxol-5-yl)-5-hydroxy-5-(4-methoxyphenyl)-4-(3,4,5-trimethoxybenzyl)furan-2(5H)-one CHEMBL8981 PD156707
TypeSmall organic molecule
Emp. Form.C28H26O9
Mol. Mass.506.5006
SMILESCOc1ccc(cc1)C1(O)OC(=O)C(=C1Cc1cc(OC)c(OC)c(OC)c1)c1ccc2OCOc2c1