Reaction Details
TargetEndothelin receptor type B
LigandBDBM50034267
Substrate/Competitorn/a
Ki 1420±n/a nM
CommentsPDSP_1446
Citation Maguire, JJKuc, REDavenport, AP Affinity and selectivity of PD156707, a novel nonpeptide endothelin antagonist, for human ET(A) and ET(B) receptors. J Pharmacol Exp Ther280:1102-8 (1997) Endothelin receptor type B
Name:Endothelin receptor type B
Type:Enzyme Catalytic Domain
Mol. Mass.:49664.00
Organism:Homo sapiens (Human)
Description:ENDOTHELIN B EDNRB HUMAN::P24530
Residue:442
BDBM50034267
NameBDBM50034267
Synonyms:3-(benzo[d][1,3]dioxol-5-yl)-5-hydroxy-5-(4-methoxyphenyl)-4-(3,4,5-trimethoxybenzyl)furan-2(5H)-one CHEMBL8981 PD156707
TypeSmall organic molecule
Emp. Form.C28H26O9
Mol. Mass.506.5006
SMILESCOc1ccc(cc1)C1(O)OC(=O)C(=C1Cc1cc(OC)c(OC)c(OC)c1)c1ccc2OCOc2c1