Reaction Details
TargetSomatostatin receptor type 1
LigandBDBM85051
Substrate/Competitorn/a
Ki 4577±n/a nM
CommentsPDSP_7425
Citation Shimon, ITaylor, JEDong, JZBitonte, RAKim, SMorgan, BCoy, DHCuller, MDMelmed, S Somatostatin receptor subtype specificity in human fetal pituitary cultures. Differential role of SSTR2 and SSTR5 for growth hormone, thyroid-stimulating hormone, and prolactin regulation. J Clin Invest99:789-98 (1997) 
 
Somatostatin receptor type 1
Name:Somatostatin receptor type 1
Type:Enzyme
Mol. Mass.:42692.81
Organism:Homo sapiens (Human)
Description:P30872
Residue:391
BDBM85051
NameBDBM85051
Synonyms:BIM-23190
TypeSmall organic molecule
Emp. Form.C57H79N13O12S2
Mol. Mass.1202.447
SMILESCC[C@@H]1NC(=O)[C@H](CCCCN)NC(=O)[C@@H](Cc2c[nH]c3ccccc23)NC(=O)[C@H](Cc2ccc(O)cc2)NC(=O)[C@H](CSSC[C@H](NC1=O)C(=O)N[C@@H]([C@@H](C)O)C(N)=O)NC(=O)[C@@H](Cc1ccccc1)NC(=O)CN1CCN(CCO)CC1