Reaction Details
TargetSomatostatin receptor type 2
LigandBDBM82465
Substrate/Competitorn/a
Ki 0.42±n/a nM
CommentsPDSP_374
Citation Shimon, ITaylor, JEDong, JZBitonte, RAKim, SMorgan, BCoy, DHCuller, MDMelmed, S Somatostatin receptor subtype specificity in human fetal pituitary cultures. Differential role of SSTR2 and SSTR5 for growth hormone, thyroid-stimulating hormone, and prolactin regulation. J Clin Invest99:789-98 (1997) 
 
Somatostatin receptor type 2
Name:Somatostatin receptor type 2
Type:Enzyme
Mol. Mass.:41344.94
Organism:Homo sapiens (Human)
Description:P30874
Residue:369
BDBM82465
NameBDBM82465
Synonyms:BIM 23023 D-Phe-L-Cys(1)-L-Tyr-D-Trp-L-Lys-L-Abu-L-Cys(1)-L-Thr-NH2
TypeSmall organic molecule
Emp. Form.C49H65N11O10S2
Mol. Mass.1032.238
SMILESCC[C@@H]1NC(=O)[C@H](CCCCN)NC(=O)[C@@H](Cc2c[nH]c3ccccc23)NC(=O)[C@H](Cc2ccc(O)cc2)NC(=O)[C@H](CSSC[C@H](NC1=O)C(=O)N[C@@H]([C@@H](C)O)C(N)=O)NC(=O)[C@H](N)Cc1ccccc1