Reaction Details
TargetSomatostatin receptor type 4
LigandBDBM82470
Substrate/Competitorn/a
Ki 2100±n/a nM
CommentsPDSP_373
Citation Shimon, ITaylor, JEDong, JZBitonte, RAKim, SMorgan, BCoy, DHCuller, MDMelmed, S Somatostatin receptor subtype specificity in human fetal pituitary cultures. Differential role of SSTR2 and SSTR5 for growth hormone, thyroid-stimulating hormone, and prolactin regulation. J Clin Invest99:789-98 (1997) 
 
Somatostatin receptor type 4
Name:Somatostatin receptor type 4
Type:Enzyme
Mol. Mass.:42015.38
Organism:Homo sapiens (Human)
Description:P31391
Residue:388
BDBM82470
NameBDBM82470
Synonyms:3-(2-Naphtyl)-D-Ala-L-Cys(1)-L-Tyr-D-Trp-L-Lys-L-Val-L-Cys(1)-L-Thr-NH2 BIM-23014 | LANREOTIDE
TypeSmall organic molecule
Emp. Form.C54H69N11O10S2
Mol. Mass.1096.323
SMILESCC(C)[C@@H]1NC(=O)[C@H](CCCCN)NC(=O)[C@@H](Cc2c[nH]c3ccccc23)NC(=O)[C@H](Cc2ccc(O)cc2)NC(=O)[C@H](CSSC[C@H](NC1=O)C(=O)N[C@@H]([C@@H](C)O)C(N)=O)NC(=O)[C@H](N)Cc1ccc2ccccc2c1