Reaction Details
TargetD(1A) dopamine receptor
LigandBDBM81487
Substrate/Competitorn/a
Ki 360±n/a nM
CommentsPDSP_540
Citation Creese, IBurt, DRSnyder, SH Dopamine receptor binding predicts clinical and pharmacological potencies of antischizophrenic drugs. J Neuropsychiatry Clin Neurosci8:223-6 (1996) 
 
D(1A) dopamine receptor
Name:D(1A) dopamine receptor
Type:Enzyme Catalytic Domain
Mol. Mass.:49330.65
Organism:BOVINE
Description:DOPAMINE D1 DRD1 BOVINE::Q95136
Residue:446
BDBM81487
NameBDBM81487
Synonyms:CAS_10457-91-7 NSC_25293
TypeSmall organic molecule
Emp. Form.C22H22ClF4NO2
Mol. Mass.443.862
SMILESOC1(CCN(CCCC(=O)c2ccc(F)cc2)CC1)c1ccc(Cl)c(c1)C(F)(F)F