Reaction Details
TargetD(1A) dopamine receptor
LigandBDBM50019959
Substrate/Competitorn/a
Ki 800±n/a nM
CommentsPDSP_826
Citation Creese, IBurt, DRSnyder, SH Dopamine receptor binding predicts clinical and pharmacological potencies of antischizophrenic drugs. J Neuropsychiatry Clin Neurosci8:223-6 (1996) 
 
D(1A) dopamine receptor
Name:D(1A) dopamine receptor
Type:Enzyme Catalytic Domain
Mol. Mass.:49330.65
Organism:BOVINE
Description:DOPAMINE D1 DRD1 BOVINE::Q95136
Residue:446
BDBM50019959
NameBDBM50019959
Synonyms:1-(4-Fluoro-phenyl)-4-[4-(2-methoxy-phenyl)-piperazin-1-yl]-butan-1-one CHEMBL58792 | Fluanisone
TypeSmall organic molecule
Emp. Form.C21H25FN2O2
Mol. Mass.356.4338
SMILESCOc1ccccc1N1CCN(CCCC(=O)c2ccc(F)cc2)CC1