Reaction Details
TargetD(1A) dopamine receptor
LigandBDBM26948
Substrate/Competitorn/a
Ki 1400±n/a nM
CommentsPDSP_843
Citation Creese, IBurt, DRSnyder, SH Dopamine receptor binding predicts clinical and pharmacological potencies of antischizophrenic drugs. J Neuropsychiatry Clin Neurosci8:223-6 (1996) 
 
D(1A) dopamine receptor
Name:D(1A) dopamine receptor
Type:Enzyme Catalytic Domain
Mol. Mass.:49330.65
Organism:BOVINE
Description:DOPAMINE D1 DRD1 BOVINE::Q95136
Residue:446
BDBM26948
NameBDBM26948
Synonyms:8-[4,4-bis(4-fluorophenyl)butyl]-1-phenyl-1,3,8-triazaspiro[4.5]decan-4-one FLUSPIRILENE cid_3396 spiropiperidine analogue, 1
TypeSmall organic molecule
Emp. Form.C29H31F2N3O
Mol. Mass.475.5727
SMILESFc1ccc(cc1)C(CCCN1CCC2(CC1)N(CNC2=O)c1ccccc1)c1ccc(F)cc1