Reaction Details
TargetD(1A) dopamine receptor
LigandBDBM81493
Substrate/Competitorn/a
Ki 740±n/a nM
CommentsPDSP_2608
Citation Creese, IBurt, DRSnyder, SH Dopamine receptor binding predicts clinical and pharmacological potencies of antischizophrenic drugs. J Neuropsychiatry Clin Neurosci8:223-6 (1996) 
 
D(1A) dopamine receptor
Name:D(1A) dopamine receptor
Type:Enzyme Catalytic Domain
Mol. Mass.:49330.65
Organism:BOVINE
Description:DOPAMINE D1 DRD1 BOVINE::Q95136
Residue:446
BDBM81493
NameBDBM81493
Synonyms:CAS_749-13-3 | TRIFLUORPERIDOL
TypeSmall organic molecule
Emp. Form.C22H23F4NO2
Mol. Mass.409.4171
SMILESOC1(CCN(CC1)C(F)CCC(=O)c1ccccc1)c1cccc(c1)C(F)(F)F