Reaction Details
TargetD(2) dopamine receptor
LigandBDBM50036733
Substrate/Competitorn/a
Ki 10±n/a nM
CommentsPDSP_337
Citation Creese, IBurt, DRSnyder, SH Dopamine receptor binding predicts clinical and pharmacological potencies of antischizophrenic drugs. J Neuropsychiatry Clin Neurosci8:223-6 (1996) 
 
D(2) dopamine receptor
Name:D(2) dopamine receptor
Type:Enzyme Catalytic Domain
Mol. Mass.:50698.79
Organism:BOVINE
Description:P20288
Residue:444
BDBM50036733
NameBDBM50036733
Synonyms:1-(4-Fluoro-phenyl)-4-(4-pyridin-2-yl-piperazin-1-yl)-butan-1-one(Azaperone) CHEMBL340211
TypeSmall organic molecule
Emp. Form.C19H22FN3O
Mol. Mass.327.3959
SMILESFc1ccc(cc1)C(=O)CCCN1CCN(CC1)c1ccccn1