Reaction Details
TargetD(2) dopamine receptor
LigandBDBM50019959
Substrate/Competitorn/a
Ki 3.8±n/a nM
CommentsPDSP_826
Citation Creese, IBurt, DRSnyder, SH Dopamine receptor binding predicts clinical and pharmacological potencies of antischizophrenic drugs. J Neuropsychiatry Clin Neurosci8:223-6 (1996) 
 
D(2) dopamine receptor
Name:D(2) dopamine receptor
Type:Enzyme Catalytic Domain
Mol. Mass.:50698.79
Organism:BOVINE
Description:P20288
Residue:444
BDBM50019959
NameBDBM50019959
Synonyms:1-(4-Fluoro-phenyl)-4-[4-(2-methoxy-phenyl)-piperazin-1-yl]-butan-1-one CHEMBL58792 | Fluanisone
TypeSmall organic molecule
Emp. Form.C21H25FN2O2
Mol. Mass.356.4338
SMILESCOc1ccccc1N1CCN(CCCC(=O)c2ccc(F)cc2)CC1