Reaction Details
TargetD(2) dopamine receptor
LigandBDBM50026957
Substrate/Competitorn/a
Ki 1.1±n/a nM
CommentsPDSP_268
Citation Creese, IBurt, DRSnyder, SH Dopamine receptor binding predicts clinical and pharmacological potencies of antischizophrenic drugs. J Neuropsychiatry Clin Neurosci8:223-6 (1996) 
 
D(2) dopamine receptor
Name:D(2) dopamine receptor
Type:Enzyme Catalytic Domain
Mol. Mass.:50698.79
Organism:BOVINE
Description:P20288
Residue:444
BDBM50026957
NameBDBM50026957
Synonyms:(cis) 2-{4-[3-(2-Trifluoromethyl-thioxanthen-9-ylidene)-propyl]-piperazin-1-yl}-ethanol(Flupentixol) 2-(4-{3-[2-Trifluoromethyl-thioxanthen-(9E)-ylidene]-propyl}-piperazin-1-yl)-ethanol FLUPENTHIXOL, Alpha Flupenthixol | Flupenthixol, Beta
TypeSmall organic molecule
Emp. Form.C23H25F3N2OS
Mol. Mass.434.518
SMILESOCCN1CCN(CC\C=C2/c3ccccc3Sc3ccc(cc23)C(F)(F)F)CC1