Reaction Details
TargetD(2) dopamine receptor
LigandBDBM79181
Substrate/Competitorn/a
Ki 2.1±n/a nM
CommentsPDSP_1908
Citation Creese, IBurt, DRSnyder, SH Dopamine receptor binding predicts clinical and pharmacological potencies of antischizophrenic drugs. J Neuropsychiatry Clin Neurosci8:223-6 (1996) 
 
D(2) dopamine receptor
Name:D(2) dopamine receptor
Type:Enzyme Catalytic Domain
Mol. Mass.:50698.79
Organism:BOVINE
Description:P20288
Residue:444
BDBM79181
NameBDBM79181
Synonyms:10-[3-(4-methyl-1-piperazinyl)propyl]-2-(trifluoromethyl)phenothiazine;hydrochloride 10-[3-(4-methylpiperazino)propyl]-2-(trifluoromethyl)phenothiazine;hydrochloride SMR000059133 TRIFLUOPERAZINE DIHYDROCHLORIDE US11542290, Compound Trifluoperazine cid_5566
TypeSmall organic molecule
Emp. Form.C21H24F3N3S
Mol. Mass.407.496
SMILESCN1CCN(CCCN2c3ccccc3Sc3ccc(cc23)C(F)(F)F)CC1