Reaction Details
TargetNitric oxide synthase, brain
LigandBDBM275051
Substrate/Competitorn/a
Meas. Tech.Caco-2 Assay
Ki 19.0±n/a nM
Citation Silverman, RBMukherjee, PNguyen, HM 2-imidazolyl-pyrimidine scaffolds as potent and selective inhibitors of neuronal nitric oxide synthase US Patent US9878996 Publication Date 1/30/2018
 
Nitric oxide synthase, brain
Name:Nitric oxide synthase, brain
Type:Enzyme
Mol. Mass.:160570.98
Organism:Rattus norvegicus (rat)
Description:Recombinant nNOS overexpressed in E. coli was used in enzyme assays.
Residue:1429
BDBM275051
NameBDBM275051
Synonyms:US9878996, Compound 7
TypeSmall organic molecule
Emp. Form.C18H20FN5
Mol. Mass.325.3833
SMILESFc1cccc(CCCNCCc2ccnc(n2)-n2ccnc2)c1